Reaction Details
TargetVascular endothelial growth factor receptor 2
LigandBDBM50306681
Substrate/Competitorn/a
Meas. Tech.ChEMBL_611550 (CHEMBL1066394)
IC50 32000±n/a nM
Citation Nishii, HChiba, TMorikami, KFukami, TASakamoto, HKo, KKoyano, H Discovery of 6-benzyloxyquinolines as c-Met selective kinase inhibitors. Bioorg Med Chem Lett20:1405-9 (2010) 
 
Vascular endothelial growth factor receptor 2
Name:Vascular endothelial growth factor receptor 2
Type:Receptor Tyrosine Kinase
Mol. Mass.:151510.97
Organism:Homo sapiens (Human)
Description:P35968
Residue:1356
BDBM50306681
NameBDBM50306681
Synonyms:(S)-6-(1-(2,6-dichloro-3-fluorophenyl)ethoxy)quinoline | CHEMBL598523
TypeSmall organic molecule
Emp. Form.C17H12Cl2FNO
Mol. Mass.336.188
SMILESC[C@H](Oc1ccc2ncccc2c1)c1c(Cl)ccc(F)c1Cl