Reaction Details
TargetInsulin receptor
LigandBDBM50306683
Substrate/Competitorn/a
Meas. Tech.ChEMBL_611564 (CHEMBL1066408)
IC50>50000±n/a nM
Citation Nishii, HChiba, TMorikami, KFukami, TASakamoto, HKo, KKoyano, H Discovery of 6-benzyloxyquinolines as c-Met selective kinase inhibitors. Bioorg Med Chem Lett20:1405-9 (2010) 
 
Insulin receptor
Name:Insulin receptor
Type:Receptor Tyrosine Kinase
Mol. Mass.:156322.60
Organism:Homo sapiens (Human)
Description:P06213
Residue:1382
BDBM50306683
NameBDBM50306683
Synonyms:(R)-6-(1-(2,6-dichloro-3-fluorophenyl)ethoxy)quinoline | CHEMBL600795
TypeSmall organic molecule
Emp. Form.C17H12Cl2FNO
Mol. Mass.336.188
SMILESC[C@@H](Oc1ccc2ncccc2c1)c1c(Cl)ccc(F)c1Cl