Reaction Details
TargetVascular endothelial growth factor receptor 2
LigandBDBM50306678
Substrate/Competitorn/a
Meas. Tech.ChEMBL_611550 (CHEMBL1066394)
IC50 50000±n/a nM
Citation Nishii, HChiba, TMorikami, KFukami, TASakamoto, HKo, KKoyano, H Discovery of 6-benzyloxyquinolines as c-Met selective kinase inhibitors. Bioorg Med Chem Lett20:1405-9 (2010) 
 
Vascular endothelial growth factor receptor 2
Name:Vascular endothelial growth factor receptor 2
Type:Receptor Tyrosine Kinase
Mol. Mass.:151510.97
Organism:Homo sapiens (Human)
Description:P35968
Residue:1356
BDBM50306678
NameBDBM50306678
Synonyms:CHEMBL591457 | rac-3-(6-(1-(2,6-dichloro-3-fluorophenyl)ethoxy)quinolin-3-yl)propanamide
TypeSmall organic molecule
Emp. Form.C20H17Cl2FN2O2
Mol. Mass.407.266
SMILESCC(Oc1ccc2ncc(CCC(N)=O)cc2c1)c1c(Cl)ccc(F)c1Cl