Reaction Details
TargetHepatocyte growth factor receptor
LigandBDBM50306678
Substrate/Competitorn/a
Meas. Tech.ChEMBL_611549 (CHEMBL1066393)
IC50 205±n/a nM
Citation Nishii, HChiba, TMorikami, KFukami, TASakamoto, HKo, KKoyano, H Discovery of 6-benzyloxyquinolines as c-Met selective kinase inhibitors. Bioorg Med Chem Lett20:1405-9 (2010) 
 
Hepatocyte growth factor receptor
Name:Hepatocyte growth factor receptor
Type:Protein
Mol. Mass.:155559.73
Organism:Homo sapiens (Human)
Description:P08581
Residue:1390
BDBM50306678
NameBDBM50306678
Synonyms:CHEMBL591457 | rac-3-(6-(1-(2,6-dichloro-3-fluorophenyl)ethoxy)quinolin-3-yl)propanamide
TypeSmall organic molecule
Emp. Form.C20H17Cl2FN2O2
Mol. Mass.407.266
SMILESCC(Oc1ccc2ncc(CCC(N)=O)cc2c1)c1c(Cl)ccc(F)c1Cl