Reaction Details
TargetProto-oncogene tyrosine-protein kinase Src
LigandBDBM50306680
Substrate/Competitorn/a
Meas. Tech.ChEMBL_611551 (CHEMBL1066395)
IC50>50000±n/a nM
Citation Nishii, HChiba, TMorikami, KFukami, TASakamoto, HKo, KKoyano, H Discovery of 6-benzyloxyquinolines as c-Met selective kinase inhibitors. Bioorg Med Chem Lett20:1405-9 (2010) 
 
Proto-oncogene tyrosine-protein kinase Src
Name:Proto-oncogene tyrosine-protein kinase Src
Type:Protein
Mol. Mass.:59838.60
Organism:Homo sapiens (Human)
Description:P12931
Residue:536
BDBM50306680
NameBDBM50306680
Synonyms:CHEMBL598912 | rac-3-(6-(1-(2,6-dichloro-3-fluorophenyl)ethoxy)quinolin-3-yl)-N-methylacrylamide
TypeSmall organic molecule
Emp. Form.C21H17Cl2FN2O2
Mol. Mass.419.276
SMILESCNC(=O)\C=C\c1cnc2ccc(OC(C)c3c(Cl)ccc(F)c3Cl)cc2c1