Reaction Details
TargetProto-oncogene tyrosine-protein kinase Src
LigandBDBM50306681
Substrate/Competitorn/a
Meas. Tech.ChEMBL_611551 (CHEMBL1066395)
IC50>50000±n/a nM
Citation Nishii, HChiba, TMorikami, KFukami, TASakamoto, HKo, KKoyano, H Discovery of 6-benzyloxyquinolines as c-Met selective kinase inhibitors. Bioorg Med Chem Lett20:1405-9 (2010) 
 
Proto-oncogene tyrosine-protein kinase Src
Name:Proto-oncogene tyrosine-protein kinase Src
Type:Protein
Mol. Mass.:59838.60
Organism:Homo sapiens (Human)
Description:P12931
Residue:536
BDBM50306681
NameBDBM50306681
Synonyms:(S)-6-(1-(2,6-dichloro-3-fluorophenyl)ethoxy)quinoline | CHEMBL598523
TypeSmall organic molecule
Emp. Form.C17H12Cl2FNO
Mol. Mass.336.188
SMILESC[C@H](Oc1ccc2ncccc2c1)c1c(Cl)ccc(F)c1Cl