Reaction Details
TargetCoagulation factor IX
LigandBDBM50307310
Substrate/Competitorn/a
Meas. Tech.ChEMBL_610620 (CHEMBL1069634)
Ki 4±n/a nM
Citation Wang, SBeck, RBurd, ABlench, TMarlin, FAyele, TBuxton, SDagostin, CMalic, MJoshi, RBarry, JSajad, MCheung, CShaikh, SChahwala, SChander, CBaumgartner, CHolthoff, HPMurray, EBlackney, MGiddings, A Structure based drug design: development of potent and selective factor IXa (FIXa) inhibitors. J Med Chem53:1473-82 (2010) 
 
Coagulation factor IX
Name:Coagulation factor IX
Type:Enzyme
Mol. Mass.:51768.83
Organism:Homo sapiens (Human)
Description:P00740
Residue:461
BDBM50307310
NameBDBM50307310
Synonyms:CHEMBL597143 | [4-(2-Dimethylamino-ethoxy)-phenyl]-carbamic acid 2-(2-carbamimidoylbenzo[b]thiophen-4-yloxy)-2-phenyl-ethyl ester
TypeSmall organic molecule
Emp. Form.C28H30N4O4S
Mol. Mass.518.627
SMILESCN(C)CCOc1ccc(NC(=O)OCC(Oc2cccc3sc(cc23)C(N)=N)c2ccccc2)cc1