Reaction Details
TargetCoagulation factor IX
LigandBDBM50307311
Substrate/Competitorn/a
Meas. Tech.ChEMBL_610620 (CHEMBL1069634)
Ki 10±n/a nM
Citation Wang, SBeck, RBurd, ABlench, TMarlin, FAyele, TBuxton, SDagostin, CMalic, MJoshi, RBarry, JSajad, MCheung, CShaikh, SChahwala, SChander, CBaumgartner, CHolthoff, HPMurray, EBlackney, MGiddings, A Structure based drug design: development of potent and selective factor IXa (FIXa) inhibitors. J Med Chem53:1473-82 (2010) 
 
Coagulation factor IX
Name:Coagulation factor IX
Type:Enzyme
Mol. Mass.:51768.83
Organism:Homo sapiens (Human)
Description:P00740
Residue:461
BDBM50307311
NameBDBM50307311
Synonyms:CHEMBL597144 | [4-(4-Methyl-piperazin-1-ylmethyl)-phenyl]-carbamic acid 2-(2-carbamimidoylbenzo[b]thiophen-4-yloxy)-2-phenyl-ethyl ester
TypeSmall organic molecule
Emp. Form.C30H33N5O3S
Mol. Mass.543.68
SMILESCN1CCN(Cc2ccc(NC(=O)OCC(Oc3cccc4sc(cc34)C(N)=N)c3ccccc3)cc2)CC1