Reaction Details
TargetCoagulation factor IX
LigandBDBM50307312
Substrate/Competitorn/a
Meas. Tech.ChEMBL_610620 (CHEMBL1069634)
Ki 4±n/a nM
Citation Wang, SBeck, RBurd, ABlench, TMarlin, FAyele, TBuxton, SDagostin, CMalic, MJoshi, RBarry, JSajad, MCheung, CShaikh, SChahwala, SChander, CBaumgartner, CHolthoff, HPMurray, EBlackney, MGiddings, A Structure based drug design: development of potent and selective factor IXa (FIXa) inhibitors. J Med Chem53:1473-82 (2010) 
 
Coagulation factor IX
Name:Coagulation factor IX
Type:Enzyme
Mol. Mass.:51768.83
Organism:Homo sapiens (Human)
Description:P00740
Residue:461
BDBM50307312
NameBDBM50307312
Synonyms:(2-Aminomethyl-phenyl)-carbamic acid 2-(2-carbamimidoyl-benzo[b]thiophen-4-yloxy)-2-phenyl-ethyl ester | CHEMBL599394
TypeSmall organic molecule
Emp. Form.C25H24N4O3S
Mol. Mass.460.548
SMILESNCc1ccccc1NC(=O)OCC(Oc1cccc2sc(cc12)C(N)=N)c1ccccc1