Reaction Details
TargetCoagulation factor IX
LigandBDBM50307276
Substrate/Competitorn/a
Meas. Tech.ChEMBL_610620 (CHEMBL1069634)
Ki 5±n/a nM
Citation Wang, SBeck, RBurd, ABlench, TMarlin, FAyele, TBuxton, SDagostin, CMalic, MJoshi, RBarry, JSajad, MCheung, CShaikh, SChahwala, SChander, CBaumgartner, CHolthoff, HPMurray, EBlackney, MGiddings, A Structure based drug design: development of potent and selective factor IXa (FIXa) inhibitors. J Med Chem53:1473-82 (2010) 
 
Coagulation factor IX
Name:Coagulation factor IX
Type:Enzyme
Mol. Mass.:51768.83
Organism:Homo sapiens (Human)
Description:P00740
Residue:461
BDBM50307276
NameBDBM50307276
Synonyms:(5-Ethylaminomethyl-1,3-dimethyl-1H-pyrazol-4-yl)-carbamic acid 2-(2-carbamimidoyl-benzo[b]thiophen-4-yloxy)-2-phenyl-ethyl ester | CHEMBL602082
TypeSmall organic molecule
Emp. Form.C25H28N6O3S
Mol. Mass.492.593
SMILESCNCc1c(NC(=O)OCC(Oc2cccc3sc(cc23)C(N)=N)c2ccccc2)c(C)nn1C