Reaction Details
TargetSodium-dependent noradrenaline transporter
LigandBDBM50307462
Substrate/Competitorn/a
Meas. Tech.ChEMBL_611007 (CHEMBL1072383)
IC50 4.6±n/a nM
Citation Vu, ATCohn, STZhang, PKim, CYMahaney, PEBray, JAJohnston, GHKoury, EJCosmi, SADeecher, DCSmith, VAHarrison, JELeventhal, LWhiteside, GTKennedy, JDTrybulski, EJ 1-(Indolin-1-yl)-1-phenyl-3-propan-2-olamines as potent and selective norepinephrine reuptake inhibitors. J Med Chem53:2051-62 (2010) 
 
Sodium-dependent noradrenaline transporter
Name:Sodium-dependent noradrenaline transporter
Type:Multi-pass membrane protein
Mol. Mass.:69337.72
Organism:Homo sapiens (Human)
Description:P23975
Residue:617
BDBM50307462
NameBDBM50307462
Synonyms:(1S,2R)-1-(2,3-Dihydro-1H-indol-1-yl)-1-(3-fluorophenyl)-3-(methylamino)propan-2-ol Hydrochloride | CHEMBL610514
TypeSmall organic molecule
Emp. Form.C18H21FN2O
Mol. Mass.300.3705
SMILESCNC[C@@H](O)[C@@H](N1CCc2ccccc12)c1cccc(F)c1