Reaction Details
TargetSodium-dependent noradrenaline transporter
LigandBDBM50307475
Substrate/Competitorn/a
Meas. Tech.ChEMBL_611007 (CHEMBL1072383)
IC50 39±n/a nM
Citation Vu, ATCohn, STZhang, PKim, CYMahaney, PEBray, JAJohnston, GHKoury, EJCosmi, SADeecher, DCSmith, VAHarrison, JELeventhal, LWhiteside, GTKennedy, JDTrybulski, EJ 1-(Indolin-1-yl)-1-phenyl-3-propan-2-olamines as potent and selective norepinephrine reuptake inhibitors. J Med Chem53:2051-62 (2010) 
 
Sodium-dependent noradrenaline transporter
Name:Sodium-dependent noradrenaline transporter
Type:Multi-pass membrane protein
Mol. Mass.:69337.72
Organism:Homo sapiens (Human)
Description:P23975
Residue:617
BDBM50307475
NameBDBM50307475
Synonyms:(1S,2R)-1-(3-Fluorophenyl)-3-(methylamino)-1-spiro[cyclohexane-1,30-indol]-1'(2'H)-ylpropan-2-ol Hydrochloride | CHEMBL602550
TypeSmall organic molecule
Emp. Form.C23H29FN2O
Mol. Mass.368.4876
SMILESCNC[C@@H](O)[C@@H](N1CC2(CCCCC2)c2ccccc12)c1cccc(F)c1