Reaction Details
TargetSodium-dependent serotonin transporter
LigandBDBM50307468
Substrate/Competitorn/a
Meas. Tech.ChEMBL_611006 (CHEMBL1072382)
IC50 1123±n/a nM
Citation Vu, ATCohn, STZhang, PKim, CYMahaney, PEBray, JAJohnston, GHKoury, EJCosmi, SADeecher, DCSmith, VAHarrison, JELeventhal, LWhiteside, GTKennedy, JDTrybulski, EJ 1-(Indolin-1-yl)-1-phenyl-3-propan-2-olamines as potent and selective norepinephrine reuptake inhibitors. J Med Chem53:2051-62 (2010) 
 
Sodium-dependent serotonin transporter
Name:Sodium-dependent serotonin transporter
Type:Multi-pass membrane protein
Mol. Mass.:70322.51
Organism:Homo sapiens (Human)
Description:P31645
Residue:630
BDBM50307468
NameBDBM50307468
Synonyms:(1S,2R)-1-(3-Fluorophenyl)-1-(3-isopropyl-2,3-dihydro-1Hindol-1-yl)-3-(methylamino)propan-2-ol Hydrochloride | CHEMBL606174
TypeSmall organic molecule
Emp. Form.C21H27FN2O
Mol. Mass.342.4503
SMILESCNC[C@@H](O)[C@@H](N1CC(C(C)C)c2ccccc12)c1cccc(F)c1