Reaction Details
TargetCyclin-A1/Cyclin-A2/Cyclin-dependent kinase 2
LigandBDBM50307542
Substrate/Competitorn/a
Meas. Tech.ChEMBL_611970 (CHEMBL1072177)
IC50 66±n/a nM
Citation Traquandi, GCiomei, MBallinari, DCasale, EColombo, NCroci, VFiorentini, FIsacchi, ALongo, AMercurio, CPanzeri, APastori, WPevarello, PVolpi, DRoussel, PVulpetti, ABrasca, MG Identification of potent pyrazolo[4,3-h]quinazoline-3-carboxamides as multi-cyclin-dependent kinase inhibitors. J Med Chem53:2171-87 (2010) 
 
Cyclin-A1/Cyclin-A2/Cyclin-dependent kinase 2
Name:Cyclin-A1/Cyclin-A2/Cyclin-dependent kinase 2
Type:n/a
Mol. Mass.:n/a
Description:ASSAY_ID of EBI is 42813
Components:This complex has 3 components.
Component 1
Name:Cyclin-A2
Synonyms:CCN1 CCNA1 CCNA2_HUMAN Cyclin-A
Type:Enzyme Subunit
Mol. Mass.:48550.19
Organism:Homo sapiens (Human)
Description:P20248
Residue:432
Component 2
Name:Cyclin-A1
Synonyms:CCNA1 CDK2/Cyclin A1 Cyclin-A1/Cyclin-dependent kinase 4
Type:Enzyme
Mol. Mass.:52343.37
Organism:Homo sapiens (Human)
Description:P78396
Residue:465
Component 3
Name:Cyclin-dependent kinase 2
Synonyms:CDK2 CDK2_HUMAN Cell division protein kinase 2 Protein cereblon/Cyclin-dependent kinase 2 | p33 protein kinase
Type:Enzyme Subunit
Mol. Mass.:33938.17
Organism:Homo sapiens (Human)
Description:P24941
Residue:298
Component 4
Name:Cyclin-A2
Synonyms:CCN1 CCNA1 CCNA2_HUMAN Cyclin-A
Type:Enzyme Subunit
Mol. Mass.:48550.19
Organism:Homo sapiens (Human)
Description:P20248
Residue:432
BDBM50307542
NameBDBM50307542
Synonyms:8-[(3-Methoxybenzyl)amino]-1-methyl-4,5-dihydro-1H-pyrazolo[4,3-h]quinazoline-3-carboxamide | CHEMBL599630
TypeSmall organic molecule
Emp. Form.C19H20N6O2
Mol. Mass.364.4011
SMILESCOc1cccc(CNc2ncc3CCc4c(nn(C)c4-c3n2)C(N)=O)c1