Reaction Details
TargetCyclin-dependent kinase/G2/mitotic-specific cyclin- 1
LigandBDBM50307507
Substrate/Competitorn/a
Meas. Tech.ChEMBL_611975 (CHEMBL1072182)
IC50 6±n/a nM
Citation Traquandi, GCiomei, MBallinari, DCasale, EColombo, NCroci, VFiorentini, FIsacchi, ALongo, AMercurio, CPanzeri, APastori, WPevarello, PVolpi, DRoussel, PVulpetti, ABrasca, MG Identification of potent pyrazolo[4,3-h]quinazoline-3-carboxamides as multi-cyclin-dependent kinase inhibitors. J Med Chem53:2171-87 (2010) 
 
Cyclin-dependent kinase/G2/mitotic-specific cyclin- 1
Name:Cyclin-dependent kinase/G2/mitotic-specific cyclin- 1
Type:Protein Complex
Mol. Mass.:n/a
Description:CDK1/Cyclin B complexes were purified from insect cells co-infected with baculovirus vectors containing each of the components.
Components:This complex has 2 components.
Component 1
Name:Cyclin-dependent kinase 1
Synonyms:CDC2 CDK1 CDKN1 Cell division protein kinase 1 P34CDC2 | p34 protein kinase
Type:Enzyme Subunit
Mol. Mass.:34101.08
Organism:Homo sapiens (Human)
Description:P06493
Residue:297
Component 2
Name:G2/mitotic-specific cyclin-B1
Synonyms:CCNB CCNB1_HUMAN
Type:Enzyme Subunit
Mol. Mass.:48340.95
Organism:Homo sapiens (Human)
Description:P14635
Residue:433
BDBM50307507
NameBDBM50307507
Synonyms:CHEMBL597754 | N-1-Dimethyl-8-{[1-(methylsulfonyl)piperidin-4-yl]amino}-4,5-dihydro-1H-pyrazolo[4,3-h]quinazoline-3-carboxamide
TypeSmall organic molecule
Emp. Form.C24H34N8O4S
Mol. Mass.530.643
SMILESCNC(=O)c1nn(C)c-2c1CCc1cnc(NC3CCN(CC3)C(=O)C3CCN(CC3)S(C)(=O)=O)nc-21