Reaction Details
TargetCyclin-dependent kinase/G2/mitotic-specific cyclin- 1
LigandBDBM50307535
Substrate/Competitorn/a
Meas. Tech.ChEMBL_611975 (CHEMBL1072182)
IC50 5±n/a nM
Citation Traquandi, GCiomei, MBallinari, DCasale, EColombo, NCroci, VFiorentini, FIsacchi, ALongo, AMercurio, CPanzeri, APastori, WPevarello, PVolpi, DRoussel, PVulpetti, ABrasca, MG Identification of potent pyrazolo[4,3-h]quinazoline-3-carboxamides as multi-cyclin-dependent kinase inhibitors. J Med Chem53:2171-87 (2010) 
 
Cyclin-dependent kinase/G2/mitotic-specific cyclin- 1
Name:Cyclin-dependent kinase/G2/mitotic-specific cyclin- 1
Type:Protein Complex
Mol. Mass.:n/a
Description:CDK1/Cyclin B complexes were purified from insect cells co-infected with baculovirus vectors containing each of the components.
Components:This complex has 2 components.
Component 1
Name:Cyclin-dependent kinase 1
Synonyms:CDC2 CDK1 CDKN1 Cell division protein kinase 1 P34CDC2 | p34 protein kinase
Type:Enzyme Subunit
Mol. Mass.:34101.08
Organism:Homo sapiens (Human)
Description:P06493
Residue:297
Component 2
Name:G2/mitotic-specific cyclin-B1
Synonyms:CCNB CCNB1_HUMAN
Type:Enzyme Subunit
Mol. Mass.:48340.95
Organism:Homo sapiens (Human)
Description:P14635
Residue:433
BDBM50307535
NameBDBM50307535
Synonyms:8-[(1-Acetylpiperidin-4-yl)amino]-1-methyl-4,5-dihydro-1H-pyrazolo[4,3-h]quinazoline-3-carboxamide | CHEMBL599224
TypeSmall organic molecule
Emp. Form.C18H23N7O2
Mol. Mass.369.4209
SMILESCC(=O)N1CCC(CC1)Nc1ncc2CCc3c(nn(C)c3-c2n1)C(N)=O