Reaction Details
TargetAurora kinase A
LigandBDBM50307538
Substrate/Competitorn/a
Meas. Tech.ChEMBL_611972 (CHEMBL1072179)
IC50 442±n/a nM
Citation Traquandi, GCiomei, MBallinari, DCasale, EColombo, NCroci, VFiorentini, FIsacchi, ALongo, AMercurio, CPanzeri, APastori, WPevarello, PVolpi, DRoussel, PVulpetti, ABrasca, MG Identification of potent pyrazolo[4,3-h]quinazoline-3-carboxamides as multi-cyclin-dependent kinase inhibitors. J Med Chem53:2171-87 (2010) 
 
Aurora kinase A
Name:Aurora kinase A
Type:Serine/threonine-protein kinase
Mol. Mass.:45830.98
Organism:Homo sapiens (Human)
Description:O14965
Residue:403
BDBM50307538
NameBDBM50307538
Synonyms:8-(Cyclopentylamino)-1-(4-sulfamoylphenyl)-4,5-dihydro-1Hpyrazolo[4,3-h]quinazoline-3-carboxamide | CHEMBL606000
TypeSmall organic molecule
Emp. Form.C21H23N7O3S
Mol. Mass.453.517
SMILESNC(=O)c1nn(c-2c1CCc1cnc(NC3CCCC3)nc-21)-c1ccc(cc1)S(N)(=O)=O