Reaction Details
TargetAurora kinase A
LigandBDBM50307541
Substrate/Competitorn/a
Meas. Tech.ChEMBL_611972 (CHEMBL1072179)
IC50 1004±n/a nM
Citation Traquandi, GCiomei, MBallinari, DCasale, EColombo, NCroci, VFiorentini, FIsacchi, ALongo, AMercurio, CPanzeri, APastori, WPevarello, PVolpi, DRoussel, PVulpetti, ABrasca, MG Identification of potent pyrazolo[4,3-h]quinazoline-3-carboxamides as multi-cyclin-dependent kinase inhibitors. J Med Chem53:2171-87 (2010) 
 
Aurora kinase A
Name:Aurora kinase A
Type:Serine/threonine-protein kinase
Mol. Mass.:45830.98
Organism:Homo sapiens (Human)
Description:O14965
Residue:403
BDBM50307541
NameBDBM50307541
Synonyms:8-(Benzylamino)-1-methyl-4,5-dihydro-1H-pyrazolo[4,3-h]quinazoline-3-carboxamide | CHEMBL599629
TypeSmall organic molecule
Emp. Form.C18H18N6O
Mol. Mass.334.3751
SMILESCn1nc(C(N)=O)c2CCc3cnc(NCc4ccccc4)nc3-c12