Reaction Details
TargetFibroblast growth factor receptor 1
LigandBDBM50307506
Substrate/Competitorn/a
Meas. Tech.ChEMBL_611993 (CHEMBL1072200)
IC50>10000±n/a nM
Citation Traquandi, GCiomei, MBallinari, DCasale, EColombo, NCroci, VFiorentini, FIsacchi, ALongo, AMercurio, CPanzeri, APastori, WPevarello, PVolpi, DRoussel, PVulpetti, ABrasca, MG Identification of potent pyrazolo[4,3-h]quinazoline-3-carboxamides as multi-cyclin-dependent kinase inhibitors. J Med Chem53:2171-87 (2010) 
 
Fibroblast growth factor receptor 1
Name:Fibroblast growth factor receptor 1
Type:Receptor
Mol. Mass.:91861.70
Organism:Homo sapiens (Human)
Description:P11362
Residue:822
BDBM50307506
NameBDBM50307506
Synonyms:1-Methyl-8-{[1-(phenylcarbonyl)piperidin-4-yl]amino}-4,5-dihydro-1H-pyrazolo[4,3-h]quinazoline-3-carboxamide | CHEMBL599428
TypeSmall organic molecule
Emp. Form.C23H25N7O2
Mol. Mass.431.4903
SMILESCn1nc(C(N)=O)c2CCc3cnc(NC4CCN(CC4)C(=O)c4ccccc4)nc3-c12