Reaction Details
TargetMast/stem cell growth factor receptor Kit
LigandBDBM50307879
Substrate/Competitorn/a
Meas. Tech.ChEMBL_612856 (CHEMBL1067545)
IC50 216±n/a nM
Citation Nourry, AZambon, ADavies, LNiculescu-Duvaz, IDijkstra, HPMénard, DGaulon, CNiculescu-Duvaz, DSuijkerbuijk, BMFriedlos, FManne, HAKirk, RWhittaker, SMarais, RSpringer, CJ BRAF inhibitors based on an imidazo[4,5]pyridin-2-one scaffold and a meta substituted middle ring. J Med Chem53:1964-78 (2010) 
 
Mast/stem cell growth factor receptor Kit
Name:Mast/stem cell growth factor receptor Kit
Type:Protein
Mol. Mass.:109869.37
Organism:Homo sapiens (Human)
Description:P10721
Residue:976
BDBM50307879
NameBDBM50307879
Synonyms:CHEMBL602123 | N-(2,3,4-trifluoro-5-(2-oxo-2,3-dihydro-1H-imidazo[4,5-b]pyridin-7-yloxy)phenyl)-3-(trifluoromethoxy)benzamide
TypeSmall organic molecule
Emp. Form.C21H11F6N3O4
Mol. Mass.483.3202
SMILESFc1c(NC(=O)c2cccc(OC(F)(F)F)c2)cc(Oc2cccc3[nH]c(=O)[nH]c23)c(F)c1F