Reaction Details
TargetMitogen-activated protein kinase 14
LigandBDBM50307880
Substrate/Competitorn/a
Meas. Tech.ChEMBL_612860 (CHEMBL1067549)
IC50 1500±n/a nM
Citation Nourry, AZambon, ADavies, LNiculescu-Duvaz, IDijkstra, HPMénard, DGaulon, CNiculescu-Duvaz, DSuijkerbuijk, BMFriedlos, FManne, HAKirk, RWhittaker, SMarais, RSpringer, CJ BRAF inhibitors based on an imidazo[4,5]pyridin-2-one scaffold and a meta substituted middle ring. J Med Chem53:1964-78 (2010) 
 
Mitogen-activated protein kinase 14
Name:Mitogen-activated protein kinase 14
Type:Serine/threonine-protein kinase
Mol. Mass.:41286.76
Organism:Homo sapiens (Human)
Description:Q16539
Residue:360
BDBM50307880
NameBDBM50307880
Synonyms:CHEMBL598626 | N-(3-tert-butyl-1-phenyl-1H-pyrazol-5-yl)-3-(2-oxo-2,3-dihydro-1H-imidazo[4,5-b]pyridin-7-yloxy)benzamide
TypeSmall organic molecule
Emp. Form.C27H25N5O3
Mol. Mass.467.5191
SMILESCC(C)(C)c1cc(NC(=O)c2cccc(Oc3cccc4[nH]c(=O)[nH]c34)c2)n(n1)-c1ccccc1