Reaction Details
TargetCytochrome P450 3A4
LigandBDBM50307942
Substrate/Competitorn/a
Meas. Tech.ChEMBL_608357 (CHEMBL1074391)
IC50>10000±n/a nM
Citation McHardy, TCaldwell, JJCheung, KMHunter, LJTaylor, KRowlands, MRuddle, RHenley, Ade Haven Brandon, AValenti, MDavies, TGFazal, LSeavers, LRaynaud, FIEccles, SAAherne, GWGarrett, MDCollins, I Discovery of 4-amino-1-(7H-pyrrolo[2,3-d]pyrimidin-4-yl)piperidine-4-carboxamides as selective, orally active inhibitors of protein kinase B (Akt). J Med Chem53:2239-49 (2010) 
 
Cytochrome P450 3A4
Name:Cytochrome P450 3A4
Type:Enzyme
Mol. Mass.:57349.57
Organism:Homo sapiens (Human)
Description:n/a
Residue:503
BDBM50307942
NameBDBM50307942
Synonyms:4-Amino-N-(4-chlorobenzyl)-1-(7H-pyrrolo[2,3-d]pyrimidin-4-yl)piperidine-4-carboxamide US8796293, 69
TypeSmall organic molecule
Emp. Form.C19H21ClN6O
Mol. Mass.384.863
SMILESNC1(CCN(CC1)c1ncnc2[nH]ccc12)C(=O)NCc1ccc(Cl)cc1