Reaction Details
TargetRAC-beta serine/threonine-protein kinase
LigandBDBM50307966
Substrate/Competitorn/a
Meas. Tech.ChEMBL_608104 (CHEMBL1072809)
IC50 12±n/a nM
Citation McHardy, TCaldwell, JJCheung, KMHunter, LJTaylor, KRowlands, MRuddle, RHenley, Ade Haven Brandon, AValenti, MDavies, TGFazal, LSeavers, LRaynaud, FIEccles, SAAherne, GWGarrett, MDCollins, I Discovery of 4-amino-1-(7H-pyrrolo[2,3-d]pyrimidin-4-yl)piperidine-4-carboxamides as selective, orally active inhibitors of protein kinase B (Akt). J Med Chem53:2239-49 (2010) 
 
RAC-beta serine/threonine-protein kinase
Name:RAC-beta serine/threonine-protein kinase
Type:Enzyme
Mol. Mass.:55766.64
Organism:Homo sapiens (Human)
Description:n/a
Residue:481
BDBM50307966
NameBDBM50307966
Synonyms:4-Amino-N-(4-chlorobenzyl)-1-(1H-pyrrolo[2,3-b]pyridin-4-yl)piperidine-4-carboxamide | CHEMBL599448
TypeSmall organic molecule
Emp. Form.C20H22ClN5O
Mol. Mass.383.875
SMILESNC1(CCN(CC1)c1ccnc2[nH]ccc12)C(=O)NCc1ccc(Cl)cc1