Reaction Details
TargetRAC-beta serine/threonine-protein kinase
LigandBDBM50307972
Substrate/Competitorn/a
Meas. Tech.ChEMBL_608104 (CHEMBL1072809)
IC50 19±n/a nM
Citation McHardy, TCaldwell, JJCheung, KMHunter, LJTaylor, KRowlands, MRuddle, RHenley, Ade Haven Brandon, AValenti, MDavies, TGFazal, LSeavers, LRaynaud, FIEccles, SAAherne, GWGarrett, MDCollins, I Discovery of 4-amino-1-(7H-pyrrolo[2,3-d]pyrimidin-4-yl)piperidine-4-carboxamides as selective, orally active inhibitors of protein kinase B (Akt). J Med Chem53:2239-49 (2010) 
 
RAC-beta serine/threonine-protein kinase
Name:RAC-beta serine/threonine-protein kinase
Type:Enzyme
Mol. Mass.:55766.64
Organism:Homo sapiens (Human)
Description:n/a
Residue:481
BDBM50307972
NameBDBM50307972
Synonyms:4-(3-(Trifluoromethoxy)benzyl)-1-(7H-pyrrolo[2,3-d]pyrimidin-4-yl)-piperidin-4-amine | CHEMBL597818
TypeSmall organic molecule
Emp. Form.C19H20F3N5O
Mol. Mass.391.3902
SMILESNC1(Cc2cccc(OC(F)(F)F)c2)CCN(CC1)c1ncnc2[nH]ccc12