Reaction Details
TargetRAC-alpha serine/threonine-protein kinase
LigandBDBM50307945
Substrate/Competitorn/a
Meas. Tech.ChEMBL_608354 (CHEMBL1074388)
IC50 6.5±n/a nM
Citation McHardy, TCaldwell, JJCheung, KMHunter, LJTaylor, KRowlands, MRuddle, RHenley, Ade Haven Brandon, AValenti, MDavies, TGFazal, LSeavers, LRaynaud, FIEccles, SAAherne, GWGarrett, MDCollins, I Discovery of 4-amino-1-(7H-pyrrolo[2,3-d]pyrimidin-4-yl)piperidine-4-carboxamides as selective, orally active inhibitors of protein kinase B (Akt). J Med Chem53:2239-49 (2010) 
 
RAC-alpha serine/threonine-protein kinase
Name:RAC-alpha serine/threonine-protein kinase
Type:Enzyme
Mol. Mass.:55681.25
Organism:Homo sapiens (Human)
Description:P31749
Residue:480
BDBM50307945
NameBDBM50307945
Synonyms:4-(4-tert-Butylbenzyl)-1-(1H-pyrazolo[3,4-b]pyridin-4-yl)piperidin-4-amine | CHEMBL603675
TypeSmall organic molecule
Emp. Form.C22H29N5
Mol. Mass.363.4992
SMILESCC(C)(C)c1ccc(CC2(N)CCN(CC2)c2ccnc3[nH]ncc23)cc1