Reaction Details
TargetRAC-alpha serine/threonine-protein kinase
LigandBDBM50307958
Substrate/Competitorn/a
Meas. Tech.ChEMBL_608354 (CHEMBL1074388)
IC50>50±n/a nM
Citation McHardy, TCaldwell, JJCheung, KMHunter, LJTaylor, KRowlands, MRuddle, RHenley, Ade Haven Brandon, AValenti, MDavies, TGFazal, LSeavers, LRaynaud, FIEccles, SAAherne, GWGarrett, MDCollins, I Discovery of 4-amino-1-(7H-pyrrolo[2,3-d]pyrimidin-4-yl)piperidine-4-carboxamides as selective, orally active inhibitors of protein kinase B (Akt). J Med Chem53:2239-49 (2010) 
 
RAC-alpha serine/threonine-protein kinase
Name:RAC-alpha serine/threonine-protein kinase
Type:Enzyme
Mol. Mass.:55681.25
Organism:Homo sapiens (Human)
Description:P31749
Residue:480
BDBM50307958
NameBDBM50307958
Synonyms:4-Amino-N-(4-chlorobenzyl)-1-(8-oxo-8,9-dihydro-7H-purin-6-yl)-piperidine-4-carboxamide | CHEMBL598842
TypeSmall organic molecule
Emp. Form.C18H20ClN7O2
Mol. Mass.401.85
SMILESNC1(CCN(CC1)c1ncnc2[nH]c(=O)[nH]c12)C(=O)NCc1ccc(Cl)cc1