Reaction Details
TargetPotassium voltage-gated channel subfamily H member 2
LigandBDBM50308558
Substrate/Competitorn/a
Meas. Tech.ChEMBL_613538 (CHEMBL1073649)
IC50 320±n/a nM
Citation Hughes, RORogier, DJJacobsen, EJWalker, JKMacinnes, ABond, BRZhang, LLYu, YZheng, YRumsey, JMWalgren, JLCurtiss, SWFobian, YMHeasley, SECubbage, JWMoon, JBBrown, DLAcker, BAMaddux, TMTollefson, MBMischke, BVOwen, DRFreskos, JNMolyneaux, JMBenson, AGBlevis-Bal, RM Design, synthesis, and biological evaluation of 3-[4-(2-hydroxyethyl)piperazin-1-yl]-7-(6-methoxypyridin-3-yl)-1-(2-propoxyethyl)pyrido[3,4-b]pyrazin-2(1H)-one, a potent, orally active, brain penetrant inhibitor of phosphodiesterase 5 (PDE5). J Med Chem53:2656-60 (2010) 
 
Potassium voltage-gated channel subfamily H member 2
Name:Potassium voltage-gated channel subfamily H member 2
Type:Multi-pass membrane protein
Mol. Mass.:126672.65
Organism:Homo sapiens (Human)
Description:Q12809
Residue:1159
BDBM50308558
NameBDBM50308558
Synonyms:3-(4-ethylpiperazin-1-yl)-1-(2-propoxyethyl)-7-(6-methoxypyridin-3-yl)pyrido[3,4-b]pyrazin-2(1H)-one | CHEMBL590280
TypeSmall organic molecule
Emp. Form.C24H32N6O3
Mol. Mass.452.5493
SMILESCCCOCCn1c2cc(ncc2nc(N2CCN(CC)CC2)c1=O)-c1ccc(OC)nc1