Reaction Details
TargetMitogen-activated protein kinase 14
LigandBDBM50308759
Substrate/Competitorn/a
Meas. Tech.ChEMBL_607570 (CHEMBL1073514)
IC50 60±n/a nM
Citation Dietrich, JGokhale, VWang, XHurley, LHFlynn, GA Application of a novel [3+2] cycloaddition reaction to prepare substituted imidazoles and their use in the design of potent DFG-out allosteric B-Raf inhibitors. Bioorg Med Chem18:292-304 (2010) 
 
Mitogen-activated protein kinase 14
Name:Mitogen-activated protein kinase 14
Type:Serine/threonine-protein kinase
Mol. Mass.:41286.76
Organism:Homo sapiens (Human)
Description:Q16539
Residue:360
BDBM50308759
NameBDBM50308759
Synonyms:5-(4-Fluoro-3-methylphenyl)-N-(4-methyl-3-(3-methyl-4-oxo-3,4-dihydroquinazolin-6-ylamino)phenyl)-2-(trifluoromethyl)-1H-imidazole-4-carboxamide | CHEMBL589603
TypeSmall organic molecule
Emp. Form.C28H22F4N6O2
Mol. Mass.550.5069
SMILESCc1ccc(NC(=O)c2[nH]c(nc2-c2ccc(F)c(C)c2)C(F)(F)F)cc1Nc1ccc2ncn(C)c(=O)c2c1