Reaction Details
TargetAminopeptidase N
LigandBDBM23971
Substrate/Competitorn/a
Meas. Tech.ChEMBL_607644 (CHEMBL1071043)
IC50 3800±n/a nM
Citation Mou, JFang, HLiu, YShang, LWang, QZhang, LXu, W Design, synthesis and primary activity assay of bi- or tri-peptide analogues with the scaffold l-arginine as amino-peptidase N/CD13 inhibitors. Bioorg Med Chem18:887-95 (2010) 
 
Aminopeptidase N
Name:Aminopeptidase N
Type:Protein
Mol. Mass.:108810.25
Organism:Sus scrofa (Pig)
Description:P15145
Residue:963
BDBM23971
NameBDBM23971
Synonyms:(2S)-2-[(2S,3R)-3-amino-2-hydroxy-4-phenylbutanamido]-4-methylpentanoic acid CHEMBL29292 | Ubenimex
TypeSmall organic molecule
Emp. Form.C16H24N2O4
Mol. Mass.308.3728
SMILESCC(C)C[C@H](NC(=O)[C@@H](O)[C@H](N)Cc1ccccc1)C(O)=O