Reaction Details
TargetKappa-type opioid receptor
LigandBDBM50308917
Substrate/Competitorn/a
Meas. Tech.ChEMBL_611746 (CHEMBL1065783)
Ki 935±n/a nM
Citation Iyer, MRLee, YSDeschamps, JRRothman, RBDersch, CMJacobson, AERice, KC Probes for narcotic receptor mediated phenomena. 40. N-substituted cis-4a-ethyl-1,2,3,4,4a,9a-hexahydrobenzofuro[2,3-c]pyridin-8-ols. Bioorg Med Chem18:91-9 (2010) 
 
Kappa-type opioid receptor
Name:Kappa-type opioid receptor
Type:G Protein-Coupled Receptor (GPCR)
Mol. Mass.:42648.76
Organism:Homo sapiens (Human)
Description:P41145
Residue:380
BDBM50308917
NameBDBM50308917
Synonyms:CHEMBL592302 | cis-(+/-)-4a-Ethyl-2-(4-fluorophenethyl)-1,2,3,4,4a,9ahexahydrobenzofuro[2,3-c]pyridin-8-ol
TypeSmall organic molecule
Emp. Form.C21H24FNO2
Mol. Mass.341.4192
SMILESCC[C@@]12CCN(CCc3ccc(F)cc3)C[C@@H]1Oc1c2cccc1O