Reaction Details
TargetMu-type opioid receptor
LigandBDBM50308923
Substrate/Competitorn/a
Meas. Tech.ChEMBL_611744 (CHEMBL1074338)
Ki 0.900000±n/a nM
Citation Iyer, MRLee, YSDeschamps, JRRothman, RBDersch, CMJacobson, AERice, KC Probes for narcotic receptor mediated phenomena. 40. N-substituted cis-4a-ethyl-1,2,3,4,4a,9a-hexahydrobenzofuro[2,3-c]pyridin-8-ols. Bioorg Med Chem18:91-9 (2010) 
 
Mu-type opioid receptor
Name:Mu-type opioid receptor
Type:G Protein-Coupled Receptor (GPCR)
Mol. Mass.:44789.51
Organism:Homo sapiens (Human)
Description:P35372
Residue:400
BDBM50308923
NameBDBM50308923
Synonyms:2-phenethyl-1,2,3,4,4a,9a-hexahydrobenzofuro[2,3-c]pyridin-6-ol | CHEMBL592627
TypeSmall organic molecule
Emp. Form.C19H21NO2
Mol. Mass.295.3755
SMILESOc1ccc2OC3CN(CCc4ccccc4)CCC3c2c1