Reaction Details
TargetIntegrin alpha-4
LigandBDBM50309078
Substrate/Competitorn/a
Meas. Tech.ChEMBL_608124 (CHEMBL1074813)
IC50 0.220000±n/a nM
Citation Reger, TSZunic, JStock, NWang, BSmith, NDMunoz, BGreen, MDGardner, MFJames, JPChen, WAlves, KSi, QTreonze, KMLingham, RBMumford, RA Heterocycle-substituted proline dipeptides as potent VLA-4 antagonists. Bioorg Med Chem Lett20:1173-6 (2010) 
 
Integrin alpha-4
Name:Integrin alpha-4
Type:Membrane Protein
Mol. Mass.:114897.35
Organism:Homo sapiens (Human)
Description:P13612
Residue:1032
BDBM50309078
NameBDBM50309078
Synonyms:(S)-2-((2S,4R)-1-(3-cyanophenylsulfonyl)-4-(1H-pyrazol-1-yl)pyrrolidine-2-carboxamido)-3-(4-(3,5-dichloroisonicotinamido)phenyl)propanoic acid | CHEMBL601467
TypeSmall organic molecule
Emp. Form.C30H25Cl2N7O6S
Mol. Mass.682.534
SMILESOC(=O)[C@H](Cc1ccc(NC(=O)c2c(Cl)cncc2Cl)cc1)NC(=O)[C@@H]1C[C@H](CN1S(=O)(=O)c1cccc(c1)C#N)n1cccn1