Reaction Details
TargetPoly [ADP-ribose] polymerase 1
LigandBDBM50309224
Substrate/Competitorn/a
Meas. Tech.ChEMBL_608838 (CHEMBL1069057)
IC50 4.5±n/a nM
Citation Ferrigno, FBranca, DKinzel, OLillini, SLlauger Bufi, LMonteagudo, EMuraglia, ERowley, MSchultz-Fademrecht, CToniatti, CTorrisi, CJones, P Development of substituted 6-[4-fluoro-3-(piperazin-1-ylcarbonyl)benzyl]-4,5-dimethylpyridazin-3(2H)-ones as potent poly(ADP-ribose) polymerase-1 (PARP-1) inhibitors active in BRCA deficient cells. Bioorg Med Chem Lett20:1100-5 (2010) 
 
Poly [ADP-ribose] polymerase 1
Name:Poly [ADP-ribose] polymerase 1
Type:n/a
Mol. Mass.:113114.22
Organism:Homo sapiens (Human)
Description:P09874
Residue:1014
BDBM50309224
NameBDBM50309224
Synonyms:6-(4-fluoro-3-(1-methyl-1,8-diazaspiro[4.5]decane-8-carbonyl)benzyl)-4,5-dimethylpyridazin-3(2H)-one | CHEMBL598356
TypeSmall organic molecule
Emp. Form.C23H29FN4O2
Mol. Mass.412.5004
SMILESCN1CCCC11CCN(CC1)C(=O)c1cc(Cc2n[nH]c(=O)c(C)c2C)ccc1F