Reaction Details
TargetProstaglandin D2 receptor 2
LigandBDBM50309320
Substrate/Competitorn/a
Meas. Tech.ChEMBL_609122 (CHEMBL1066570)
IC50 3.1±n/a nM
Citation Grimstrup, MRist, ØReceveur, JMFrimurer, TMUlven, TMathiesen, JMKostenis, EHögberg, T Novel selective thiazoleacetic acids as CRTH2 antagonists developed from in silico derived hits. Part 2. Bioorg Med Chem Lett20:1181-5 (2010) 
 
Prostaglandin D2 receptor 2
Name:Prostaglandin D2 receptor 2
Type:Enzyme
Mol. Mass.:43295.45
Organism:Homo sapiens (Human)
Description:Q9Y5Y4
Residue:395
BDBM50309320
NameBDBM50309320
Synonyms:2-(2-(bis(4-fluorophenyl)methyl)-4-(2-methylpyridin-4-yl)thiazol-5-yl)acetic acid | CHEMBL589814
TypeSmall organic molecule
Emp. Form.C24H18F2N2O2S
Mol. Mass.436.474
SMILESCc1cc(ccn1)-c1nc(sc1CC(O)=O)C(c1ccc(F)cc1)c1ccc(F)cc1