Reaction Details
TargetPoly [ADP-ribose] polymerase 1
LigandBDBM50309350
Substrate/Competitorn/a
Meas. Tech.ChEMBL_609454 (CHEMBL1069748)
IC50 1±n/a nM
Citation Pescatore, GBranca, DFiore, FKinzel, OBufi, LLMuraglia, EOrvieto, FRowley, MToniatti, CTorrisi, CJones, P Identification and SAR of novel pyrrolo[1,2-a]pyrazin-1(2H)-one derivatives as inhibitors of poly(ADP-ribose) polymerase-1 (PARP-1). Bioorg Med Chem Lett20:1094-9 (2010) 
 
Poly [ADP-ribose] polymerase 1
Name:Poly [ADP-ribose] polymerase 1
Type:n/a
Mol. Mass.:113114.22
Organism:Homo sapiens (Human)
Description:P09874
Residue:1014
BDBM50309350
NameBDBM50309350
Synonyms:4-(3-(4-(azetidin-1-yl)piperidine-1-carbonyl)-4-fluorobenzyl)-6,7-dichloropyrrolo[1,2-a]pyrazin-1(2H)-one | CHEMBL589834
TypeSmall organic molecule
Emp. Form.C23H23Cl2FN4O2
Mol. Mass.477.359
SMILESFc1ccc(Cc2c[nH]c(=O)c3cc(Cl)c(Cl)n23)cc1C(=O)N1CCC(CC1)N1CCC1