Reaction Details
TargetAdenosine receptor A2b
LigandBDBM50309494
Substrate/Competitorn/a
Meas. Tech.ChEMBL_609500 (CHEMBL1071772)
EC50>10000±n/a nM
Citation Beattie, DBrearley, ABrown, ZCharlton, SJCox, BFairhurst, RAFozard, JRGedeck, PKirkham, PMeja, KNanson, LNeef, JOakman, HSpooner, GTaylor, RJTurner, RJWest, RWoodward, H Synthesis and evaluation of two series of 4'-aza-carbocyclic nucleosides as adenosine A2A receptor agonists. Bioorg Med Chem Lett20:1219-24 (2010) 
 
Adenosine receptor A2b
Name:Adenosine receptor A2b
Type:G Protein-Coupled Receptor (GPCR)
Mol. Mass.:36341.22
Organism:Homo sapiens (Human)
Description:n/a
Residue:332
BDBM50309494
NameBDBM50309494
Synonyms:(1R,2S,3R,5S)-3-(2-(2-(1-ethyl-1H-imidazol-4-yl)ethylamino)-6-(2-ethylbutylamino)-9H-purin-9-yl)-5-(4-(hydroxymethyl)-1H-pyrazol-1-yl)cyclopentane-1,2-diol | CHEMBL604591
TypeSmall organic molecule
Emp. Form.C27H40N10O3
Mol. Mass.552.6717
SMILESCCC(CC)CNc1nc(NCCc2cn(CC)cn2)nc2n(cnc12)[C@@H]1C[C@@H]([C@@H](O)[C@H]1O)n1cc(CO)cn1