Reaction Details
TargetAdenosine receptor A1
LigandBDBM50309487
Substrate/Competitorn/a
Meas. Tech.ChEMBL_609498 (CHEMBL1071770)
EC50>10000±n/a nM
Citation Beattie, DBrearley, ABrown, ZCharlton, SJCox, BFairhurst, RAFozard, JRGedeck, PKirkham, PMeja, KNanson, LNeef, JOakman, HSpooner, GTaylor, RJTurner, RJWest, RWoodward, H Synthesis and evaluation of two series of 4'-aza-carbocyclic nucleosides as adenosine A2A receptor agonists. Bioorg Med Chem Lett20:1219-24 (2010) 
 
Adenosine receptor A1
Name:Adenosine receptor A1
Type:G Protein-Coupled Receptor (GPCR)
Mol. Mass.:36520.92
Organism:Homo sapiens (Human)
Description:P30542
Residue:326
BDBM50309487
NameBDBM50309487
Synonyms:CHEMBL601515 | N-((2S,3S,4R,5R)-5-(6-(2,2-diphenylethylamino)-2-(2-(1-isopropyl-1H-imidazol-4-yl)ethylamino)-9H-purin-9-yl)-3,4-dihydroxytetrahydrofuran-2-yl)cyclobutanecarboxamide
TypeSmall organic molecule
Emp. Form.C37H45N9O3
Mol. Mass.663.8117
SMILESCC(C)n1cnc(CCNc2nc(NCC(c3ccccc3)c3ccccc3)c3ncn([C@@H]4C[C@H](NC(=O)C5CCC5)[C@@H](O)[C@H]4O)c3n2)c1