Reaction Details
Target5-hydroxytryptamine receptor 1A
LigandBDBM50309516
Substrate/Competitorn/a
Meas. Tech.ChEMBL_609532 (CHEMBL1072439)
Ki 29±n/a nM
Citation Dounay, ABBarta, NSCampbell, BMColeman, CCollantes, EMDenny, LDutta, SGray, DLHou, DIyer, RMaiti, SNOrtwine, DFProbert, AStratman, NCSubedi, RWhisman, TXu, WZoski, K Design, synthesis, and pharmacological evaluation of phenoxy pyridyl derivatives as dual norepinephrine reuptake inhibitors and 5-HT1A partial agonists. Bioorg Med Chem Lett20:1114-7 (2010) 
 
5-hydroxytryptamine receptor 1A
Name:5-hydroxytryptamine receptor 1A
Type:n/a
Mol. Mass.:46122.49
Organism:Homo sapiens (Human)
Description:n/a
Residue:422
BDBM50309516
NameBDBM50309516
Synonyms:2-(2,4-difluorophenoxy)-3-(piperidin-4-yl)pyridine | CHEMBL598767
TypeSmall organic molecule
Emp. Form.C16H16F2N2O
Mol. Mass.290.3078
SMILESFc1ccc(Oc2ncccc2C2CCNCC2)c(F)c1