Reaction Details
Target5-hydroxytryptamine receptor 1A
LigandBDBM50309518
Substrate/Competitorn/a
Meas. Tech.ChEMBL_609532 (CHEMBL1072439)
Ki 24±n/a nM
Citation Dounay, ABBarta, NSCampbell, BMColeman, CCollantes, EMDenny, LDutta, SGray, DLHou, DIyer, RMaiti, SNOrtwine, DFProbert, AStratman, NCSubedi, RWhisman, TXu, WZoski, K Design, synthesis, and pharmacological evaluation of phenoxy pyridyl derivatives as dual norepinephrine reuptake inhibitors and 5-HT1A partial agonists. Bioorg Med Chem Lett20:1114-7 (2010) 
 
5-hydroxytryptamine receptor 1A
Name:5-hydroxytryptamine receptor 1A
Type:n/a
Mol. Mass.:46122.49
Organism:Homo sapiens (Human)
Description:n/a
Residue:422
BDBM50309518
NameBDBM50309518
Synonyms:2-(2-fluoro-6-methoxyphenoxy)-3-(piperidin-4-yl)pyridine | CHEMBL598561
TypeSmall organic molecule
Emp. Form.C17H19FN2O2
Mol. Mass.302.3434
SMILESCOc1cccc(F)c1Oc1ncccc1C1CCNCC1