Reaction Details
TargetSodium-dependent noradrenaline transporter
LigandBDBM50309512
Substrate/Competitorn/a
Meas. Tech.ChEMBL_609533 (CHEMBL1073786)
Ki 25±n/a nM
Citation Dounay, ABBarta, NSCampbell, BMColeman, CCollantes, EMDenny, LDutta, SGray, DLHou, DIyer, RMaiti, SNOrtwine, DFProbert, AStratman, NCSubedi, RWhisman, TXu, WZoski, K Design, synthesis, and pharmacological evaluation of phenoxy pyridyl derivatives as dual norepinephrine reuptake inhibitors and 5-HT1A partial agonists. Bioorg Med Chem Lett20:1114-7 (2010) 
 
Sodium-dependent noradrenaline transporter
Name:Sodium-dependent noradrenaline transporter
Type:Multi-pass membrane protein
Mol. Mass.:69337.72
Organism:Homo sapiens (Human)
Description:P23975
Residue:617
BDBM50309512
NameBDBM50309512
Synonyms:2-(2,3-dichlorophenoxy)-3-(piperidin-4-yl)pyridine | CHEMBL600854
TypeSmall organic molecule
Emp. Form.C16H16Cl2N2O
Mol. Mass.323.217
SMILESClc1cccc(Oc2ncccc2C2CCNCC2)c1Cl