Reaction Details
TargetSodium-dependent noradrenaline transporter
LigandBDBM50309521
Substrate/Competitorn/a
Meas. Tech.ChEMBL_609533 (CHEMBL1073786)
Ki 27±n/a nM
Citation Dounay, ABBarta, NSCampbell, BMColeman, CCollantes, EMDenny, LDutta, SGray, DLHou, DIyer, RMaiti, SNOrtwine, DFProbert, AStratman, NCSubedi, RWhisman, TXu, WZoski, K Design, synthesis, and pharmacological evaluation of phenoxy pyridyl derivatives as dual norepinephrine reuptake inhibitors and 5-HT1A partial agonists. Bioorg Med Chem Lett20:1114-7 (2010) 
 
Sodium-dependent noradrenaline transporter
Name:Sodium-dependent noradrenaline transporter
Type:Multi-pass membrane protein
Mol. Mass.:69337.72
Organism:Homo sapiens (Human)
Description:P23975
Residue:617
BDBM50309521
NameBDBM50309521
Synonyms:2-(2-fluoro-6-methylphenoxy)-3-(piperidin-4-yl)pyridine | CHEMBL599592
TypeSmall organic molecule
Emp. Form.C17H19FN2O
Mol. Mass.286.344
SMILESCc1cccc(F)c1Oc1ncccc1C1CCNCC1