Reaction Details
TargetIntestinal-type alkaline phosphatase
LigandBDBM10847
Substrate/Competitorn/a
Meas. Tech.ChEMBL_610124 (CHEMBL1074489)
IC50>5000±n/a nM
Citation Lanier, MSergienko, ESimão, AMSu, YChung, TMillán, JLCashman, JR Design and synthesis of selective inhibitors of placental alkaline phosphatase. Bioorg Med Chem18:573-9 (2010) 
 
Intestinal-type alkaline phosphatase
Name:Intestinal-type alkaline phosphatase
Type:PROTEIN
Mol. Mass.:56804.94
Organism:Homo sapiens (Human)
Description:ChEMBL_1278525
Residue:528
BDBM10847
NameBDBM10847
Synonyms:1,3-dimethyl-2,3,6,7-tetrahydro-1H-purine-2,6-dione Afonilum Aminophylline Cardophyllin Theophy-lline Theophylline (1,3-dimethylxanthine)
TypeSmall organic molecule
Emp. Form.C7H8N4O2
Mol. Mass.180.164
SMILESCn1c2nc[nH]c2c(=O)n(C)c1=O