Reaction Details
TargetSodium-dependent dopamine transporter
LigandBDBM50173715
Substrate/Competitorn/a
Meas. Tech.ChEMBL_610434 (CHEMBL1074041)
IC50 4200±n/a nM
Citation Marcin, LRMattson, RJGao, QWu, DMolski, TFMattson, GKLodge, NJ Synthesis and hSERT activity of homotryptamine analogs. Part 6: [3+2] dipolar cycloaddition of 3-vinylindoles. Bioorg Med Chem Lett20:1027-30 (2010) 
 
Sodium-dependent dopamine transporter
Name:Sodium-dependent dopamine transporter
Type:Multi-pass membrane protein
Mol. Mass.:68497.11
Organism:Homo sapiens (Human)
Description:Q01959
Residue:620
BDBM50173715
NameBDBM50173715
Synonyms:(+)3-((1S,2S)-2-Dimethylaminomethyl-cyclopropyl)-1H-indole-5-carbonitrile 3-((1S,2S)-2-Dimethylaminomethyl-cyclopropyl)-1H-indole-5-carbonitrile | CHEMBL196468
TypeSmall organic molecule
Emp. Form.C15H17N3
Mol. Mass.239.3156
SMILESCN(C)C[C@H]1C[C@@H]1c1c[nH]c2ccc(cc12)C#N