Reaction Details
TargetcAMP-specific 3',5'-cyclic phosphodiesterase 4D
LigandBDBM50246052
Substrate/Competitorn/a
Meas. Tech.ChEMBL_622099 (CHEMBL1114098)
Kd 4800±n/a nM
Citation Mouri, ROishi, TTorikai, KUjihara, SMatsumori, NMurata, MOshima, Y Surface plasmon resonance-based detection of ladder-shaped polyethers by inhibition detection method. Bioorg Med Chem Lett19:2824-8 (2009) 
 
cAMP-specific 3',5'-cyclic phosphodiesterase 4D
Name:cAMP-specific 3',5'-cyclic phosphodiesterase 4D
Type:Protein
Mol. Mass.:91092.69
Organism:Homo sapiens (Human)
Description:Q08499
Residue:809
BDBM50246052
NameBDBM50246052
Synonyms:(1S,3R,5S,7R,9S,10R,12S,14R,17S,19R,21S,23R,25S,26R,28S,31R)-10-(benzyloxy)-9-[2-(benzyloxy)ethyl]-26-(hydroxymethyl)-14,31-dimethyl-4,8,13,18,22,27,32-heptaoxaheptacyclo[17.13.0.0^{3,17}.0^{5,14}.0^{7,12}.0^{21,31}.0^{23,28}]dotriacontan-25-ol | CHEMBL500181
TypeSmall organic molecule
Emp. Form.C44H60O11
Mol. Mass.764.9406
SMILESC[C@@]12CC[C@@H]3O[C@@H]4C[C@@H]5O[C@@H]6C[C@H](O)[C@@H](CO)O[C@H]6CC[C@@]5(C)O[C@H]4C[C@H]3O[C@H]1C[C@H]1O[C@@H](CCOCc3ccccc3)[C@@H](C[C@@H]1O2)OCc1ccccc1