Reaction Details
TargetEstrogen receptor
LigandBDBM50310385
Substrate/Competitorn/a
Meas. Tech.ChEMBL_622101 (CHEMBL1114100)
IC50 2.2±n/a nM
Citation Jain, NXu, JKanojia, RMDu, FJian-Zhong, GPacia, ELai, MTMusto, AAllan, GReuman, MLi, XHahn, DCousineau, MPeng, SRitchie, DRussell, RLundeen, SSui, Z Identification and structure-activity relationships of chromene-derived selective estrogen receptor modulators for treatment of postmenopausal symptoms. J Med Chem52:7544-69 (2009) 
 
Estrogen receptor
Name:Estrogen receptor
Type:Protein
Mol. Mass.:66230.44
Organism:Homo sapiens (Human)
Description:P03372
Residue:595
BDBM50310385
NameBDBM50310385
Synonyms:(R)-5-[4-(2-Azepan-1-yl-ethoxy)-phenyl]-11,12-dihydro-5H-6,13-dioxa-benzo[3,4]cyclohepta[1,2-a]naphthalene-2,8-diol | CHEMBL1087545
TypeSmall organic molecule
Emp. Form.C31H33NO5
Mol. Mass.499.5974
SMILESOc1ccc2C3=C([C@H](Oc2c1)c1ccc(OCCN2CCCCCC2)cc1)c1ccc(O)cc1OCC3