Reaction Details
TargetEstrogen receptor
LigandBDBM50310393
Substrate/Competitorn/a
Meas. Tech.ChEMBL_622101 (CHEMBL1114100)
IC50 4.2±n/a nM
Citation Jain, NXu, JKanojia, RMDu, FJian-Zhong, GPacia, ELai, MTMusto, AAllan, GReuman, MLi, XHahn, DCousineau, MPeng, SRitchie, DRussell, RLundeen, SSui, Z Identification and structure-activity relationships of chromene-derived selective estrogen receptor modulators for treatment of postmenopausal symptoms. J Med Chem52:7544-69 (2009) 
 
Estrogen receptor
Name:Estrogen receptor
Type:Protein
Mol. Mass.:66230.44
Organism:Homo sapiens (Human)
Description:P03372
Residue:595
BDBM50310393
NameBDBM50310393
Synonyms:(S)-2-Methoxy-5-[4-(2-piperidin-1-yl-ethoxy)-phenyl]-11,12-dihydro-5H-6,13-dioxa-benzo[3,4]cyclohepta[1,2-a]naphthalen-8-ol | CHEMBL1088344
TypeSmall organic molecule
Emp. Form.C31H33NO5
Mol. Mass.499.5974
SMILESCOc1ccc2C3=C(CCOc2c1)c1ccc(O)cc1O[C@H]3c1ccc(OCCN2CCCCC2)cc1