Reaction Details
TargetEstrogen receptor
LigandBDBM50310389
Substrate/Competitorn/a
Meas. Tech.ChEMBL_622101 (CHEMBL1114100)
IC50 4.5±n/a nM
Citation Jain, NXu, JKanojia, RMDu, FJian-Zhong, GPacia, ELai, MTMusto, AAllan, GReuman, MLi, XHahn, DCousineau, MPeng, SRitchie, DRussell, RLundeen, SSui, Z Identification and structure-activity relationships of chromene-derived selective estrogen receptor modulators for treatment of postmenopausal symptoms. J Med Chem52:7544-69 (2009) 
 
Estrogen receptor
Name:Estrogen receptor
Type:Protein
Mol. Mass.:66230.44
Organism:Homo sapiens (Human)
Description:P03372
Residue:595
BDBM50310389
NameBDBM50310389
Synonyms:5S-(-)-[4-(2-azepan-1-ylethoxy)phenyl]-11,12-dihydro-5H-6,13-dioxabenzo[3,4]cyclohepta[1,2-a]naphthalen-2-ol | CHEMBL1087297
TypeSmall organic molecule
Emp. Form.C31H33NO4
Mol. Mass.483.598
SMILESOc1ccc2C3=C(CCOc2c1)c1ccccc1O[C@H]3c1ccc(OCCN2CCCCCC2)cc1