Reaction Details
TargetEstrogen receptor
LigandBDBM50310370
Substrate/Competitorn/a
Meas. Tech.ChEMBL_622101 (CHEMBL1114100)
IC50 4.8±n/a nM
Citation Jain, NXu, JKanojia, RMDu, FJian-Zhong, GPacia, ELai, MTMusto, AAllan, GReuman, MLi, XHahn, DCousineau, MPeng, SRitchie, DRussell, RLundeen, SSui, Z Identification and structure-activity relationships of chromene-derived selective estrogen receptor modulators for treatment of postmenopausal symptoms. J Med Chem52:7544-69 (2009) 
 
Estrogen receptor
Name:Estrogen receptor
Type:Protein
Mol. Mass.:66230.44
Organism:Homo sapiens (Human)
Description:P03372
Residue:595
BDBM50310370
NameBDBM50310370
Synonyms:1-{2-[4-((R)-2,8-Dihydroxy-11,12-dihydro-5H-6,13-dioxa-benzo[3,4]cyclohepta[1,2-a]naphthalen-5-yl)-phenoxy]-ethyl}-pyrrolidine-2,5-dione | CHEMBL1083194
TypeSmall organic molecule
Emp. Form.C29H25NO7
Mol. Mass.499.5113
SMILESOc1ccc2C3=C([C@H](Oc2c1)c1ccc(OCCN2C(=O)CCC2=O)cc1)c1ccc(O)cc1OCC3