Reaction Details
TargetEstrogen receptor
LigandBDBM50310409
Substrate/Competitorn/a
Meas. Tech.ChEMBL_622101 (CHEMBL1114100)
IC50 5±n/a nM
Citation Jain, NXu, JKanojia, RMDu, FJian-Zhong, GPacia, ELai, MTMusto, AAllan, GReuman, MLi, XHahn, DCousineau, MPeng, SRitchie, DRussell, RLundeen, SSui, Z Identification and structure-activity relationships of chromene-derived selective estrogen receptor modulators for treatment of postmenopausal symptoms. J Med Chem52:7544-69 (2009) 
 
Estrogen receptor
Name:Estrogen receptor
Type:Protein
Mol. Mass.:66230.44
Organism:Homo sapiens (Human)
Description:P03372
Residue:595
BDBM50310409
NameBDBM50310409
Synonyms:5R-(+)-[4-(2-diethylaminoethoxy)phenyl]-11,12-dihydro-5H-6,13-dioxabenzo[3,4]cyclohepta[1,2-a]naphthalen-2-ol | CHEMBL1084128
TypeSmall organic molecule
Emp. Form.C29H31NO4
Mol. Mass.457.5607
SMILESCCN(CC)CCOc1ccc(cc1)[C@H]1Oc2ccccc2C2=C1c1ccc(O)cc1OCC2