Reaction Details
TargetEstrogen receptor
LigandBDBM50310387
Substrate/Competitorn/a
Meas. Tech.ChEMBL_622101 (CHEMBL1114100)
IC50 5.4±n/a nM
Citation Jain, NXu, JKanojia, RMDu, FJian-Zhong, GPacia, ELai, MTMusto, AAllan, GReuman, MLi, XHahn, DCousineau, MPeng, SRitchie, DRussell, RLundeen, SSui, Z Identification and structure-activity relationships of chromene-derived selective estrogen receptor modulators for treatment of postmenopausal symptoms. J Med Chem52:7544-69 (2009) 
 
Estrogen receptor
Name:Estrogen receptor
Type:Protein
Mol. Mass.:66230.44
Organism:Homo sapiens (Human)
Description:P03372
Residue:595
BDBM50310387
NameBDBM50310387
Synonyms:5R-(+)-[4-(2-diisopropylaminoethoxy)phenyl]-11,12-dihydro-5H-6,13-dioxabenzo[3,4]cyclohepta[1,2-a]naphthalene-2,8-diol | CHEMBL1085669
TypeSmall organic molecule
Emp. Form.C31H35NO5
Mol. Mass.501.6133
SMILESCC(C)N(CCOc1ccc(cc1)[C@H]1Oc2cc(O)ccc2C2=C1c1ccc(O)cc1OCC2)C(C)C